Reaction Details
TargetReverse transcriptase/RNaseH
LigandBDBM50008324
Substrate/Competitorn/a
Meas. Tech.ChEMBL_197283 (CHEMBL804270)
EC50 19000±n/a nM
Citation Kireev, DBChrétien, JRGrierson, DSMonneret, C A 3D QSAR study of a series of HEPT analogues: the influence of conformational mobility on HIV-1 reverse transcriptase inhibition. J Med Chem40:4257-64 (1998) 
 
Reverse transcriptase/RNaseH
Name:Reverse transcriptase/RNaseH
Type:PROTEIN
Mol. Mass.:65229.15
Organism:Human immunodeficiency virus 1
Description:ChEMBL_1473730
Residue:566
BDBM50008324
NameBDBM50008324
Synonyms:1-(2-Hydroxy-ethoxymethyl)-6-(2-methoxy-phenylsulfanyl)-5-methyl-1H-pyrimidine-2,4-dione | CHEMBL278944
TypeSmall organic molecule
Emp. Form.C15H18N2O5S
Mol. Mass.338.379
SMILESCOc1ccccc1Sc1c(C)c(=O)[nH]c(=O)n1COCCO