Reaction Details
TargetReverse transcriptase/RNaseH
LigandBDBM50004128
Substrate/Competitorn/a
Meas. Tech.ChEMBL_197283 (CHEMBL804270)
EC50 78±n/a nM
Citation Kireev, DBChrétien, JRGrierson, DSMonneret, C A 3D QSAR study of a series of HEPT analogues: the influence of conformational mobility on HIV-1 reverse transcriptase inhibition. J Med Chem40:4257-64 (1998) 
 
Reverse transcriptase/RNaseH
Name:Reverse transcriptase/RNaseH
Type:PROTEIN
Mol. Mass.:65229.15
Organism:Human immunodeficiency virus 1
Description:ChEMBL_1473730
Residue:566
BDBM50004128
NameBDBM50004128
Synonyms:5-Ethyl-1-(4-methyl-benzyloxymethyl)-6-phenylsulfanyl-2-thioxo-2,3-dihydro-1H-pyrimidin-4-one | CHEMBL135444
TypeSmall organic molecule
Emp. Form.C21H22N2O2S2
Mol. Mass.398.542
SMILESCCc1c(Sc2ccccc2)n(COCc2ccc(C)cc2)c(=S)[nH]c1=O