Reaction Details
TargetMuscarinic acetylcholine receptor M3
LigandBDBM50061705
Substrate/Competitorn/a
Meas. Tech.ChEMBL_138586 (CHEMBL746514)
IC50 60±n/a nM
Citation Bromidge, SMBrown, FCassidy, FClark, MSDabbs, SHadley, MSHawkins, JLoudon, JMNaylor, CBOrlek, BSRiley, GJ Design of [R-(Z)]-(+)-alpha-(methoxyimino)-1-azabicyclo[2.2.2]octane-3-acetonitri le (SB 202026), a functionally selective azabicyclic muscarinic M1 agonist incorporating the N-methoxy imidoyl nitrile group as a novel ester bioisostere. J Med Chem40:4265-80 (1998) 
 
Muscarinic acetylcholine receptor M3
Name:Muscarinic acetylcholine receptor M3
Type:Enzyme
Mol. Mass.:66151.03
Organism:Homo sapiens (Human)
Description:P20309
Residue:590
BDBM50061705
NameBDBM50061705
Synonyms:(R)-1-Aza-bicyclo[2.2.2]oct-3-yl-[(Z)-methoxyimino]-acetonitrile SB-202026
TypeSmall organic molecule
Emp. Form.C10H15N3O
Mol. Mass.193.2456
SMILESCO\N=C(/C#N)[C@H]1CN2CCC1CC2