Reaction Details
TargetIntegrin alpha-IIb/beta-3
LigandBDBM50061841
Substrate/Competitorn/a
Meas. Tech.ChEMBL_70319 (CHEMBL678024)
IC50 20±n/a nM
Citation Su, TNaughton, MASmyth, MSRose, JWArfsten, AEMcCowan, JRJakubowski, JAWyss, VLRuterbories, KJSall, DJScarborough, RM Fibrinogen receptor (GPIIb-IIIa) antagonists derived from 5,6-bicyclic templates. Amidinoindoles, amidinoindazoles, and amidinobenzofurans containing the N-alpha-sulfonamide carboxylic acid function as potent platelet aggregation inhibitors. J Med Chem40:4308-18 (1998) 
 
Integrin alpha-IIb/beta-3
Name:Integrin alpha-IIb/beta-3
Synonyms:Glycoprotein IIb/IIIa
Type:n/a
Mol. Mass.:n/a
Description:ASSAY_ID of EBI is 30109
Components:This complex has 2 components.
Component 1
Name:Integrin beta-3
Type:Protein
Mol. Mass.:87038.91
Organism:Homo sapiens (Human)
Description:P05106
Residue:788
Component 2
Name:Integrin alpha-IIb
Synonyms:CD_antigen=CD41 GPIIb Glycoprotein IIb ITGA2B Integrin alpha-IIb heavy chain Integrin alpha-IIb light chain, form 2 Integrin alpha-V/beta-3 and alpha-IIb/beta 3 | Platelet membrane glycoprotein IIb
Type:Protein
Mol. Mass.:113354.85
Organism:Homo sapiens (Human)
Description:P08514
Residue:1039
BDBM50061841
NameBDBM50061841
Synonyms:3-{3-[(5-Carbamimidoyl-benzofuran-2-carbonyl)-amino]-butyrylamino}-3-phenyl-propionic acid | CHEMBL440346
TypeSmall organic molecule
Emp. Form.C23H24N4O5
Mol. Mass.436.4605
SMILESCC(CC(=O)NC(CC(O)=O)c1ccccc1)NC(=O)c1cc2cc(ccc2o1)C(N)=N