Reaction Details
TargetKynurenine 3-monooxygenase
LigandBDBM50061916
Substrate/Competitorn/a
Meas. Tech.ChEMBL_91742 (CHEMBL874146)
Ki 4.8±n/a nM
Citation Röver, SCesura, AMHuguenin, PKettler, RSzente, A Synthesis and biochemical evaluation of N-(4-phenylthiazol-2-yl)benzenesulfonamides as high-affinity inhibitors of kynurenine 3-hydroxylase. J Med Chem40:4378-85 (1998) 
 
Kynurenine 3-monooxygenase
Name:Kynurenine 3-monooxygenase
Type:PROTEIN
Mol. Mass.:54371.88
Organism:Rattus norvegicus
Description:ChEMBL_1487468
Residue:478
BDBM50061916
NameBDBM50061916
Synonyms:3,4-Dimethoxy-N-[4-(3-nitro-phenyl)-thiazol-2-yl]-benzenesulfonamide | CHEMBL134915
TypeSmall organic molecule
Emp. Form.C17H15N3O6S2
Mol. Mass.421.448
SMILESCOc1ccc(cc1OC)S(=O)(=O)Nc1nc(cs1)-c1cccc(c1)[N+]([O-])=O