Reaction Details
TargetKynurenine 3-monooxygenase
LigandBDBM50061907
Substrate/Competitorn/a
Meas. Tech.ChEMBL_91740 (CHEMBL702202)
IC50 774±n/a nM
Citation Röver, SCesura, AMHuguenin, PKettler, RSzente, A Synthesis and biochemical evaluation of N-(4-phenylthiazol-2-yl)benzenesulfonamides as high-affinity inhibitors of kynurenine 3-hydroxylase. J Med Chem40:4378-85 (1998) 
 
Kynurenine 3-monooxygenase
Name:Kynurenine 3-monooxygenase
Type:PROTEIN
Mol. Mass.:54371.88
Organism:Rattus norvegicus
Description:ChEMBL_1487468
Residue:478
BDBM50061907
NameBDBM50061907
Synonyms:(+/-)-2-Amino-4-(3-nitro-phenyl)-4-oxo-butyric acid[(+/-)-m-nicotinylbenzoylalanine] CHEMBL23983 | meta-nitrobenzoyl)alanine
TypeSmall organic molecule
Emp. Form.C10H10N2O5
Mol. Mass.238.1968
SMILESNC(CC(=O)c1cccc(c1)[N+]([O-])=O)C(O)=O