Reaction Details
TargetKynurenine 3-monooxygenase
LigandBDBM50061909
Substrate/Competitorn/a
Meas. Tech.ChEMBL_91740 (CHEMBL702202)
IC50 76±n/a nM
Citation Röver, SCesura, AMHuguenin, PKettler, RSzente, A Synthesis and biochemical evaluation of N-(4-phenylthiazol-2-yl)benzenesulfonamides as high-affinity inhibitors of kynurenine 3-hydroxylase. J Med Chem40:4378-85 (1998) 
 
Kynurenine 3-monooxygenase
Name:Kynurenine 3-monooxygenase
Type:PROTEIN
Mol. Mass.:54371.88
Organism:Rattus norvegicus
Description:ChEMBL_1487468
Residue:478
BDBM50061909
NameBDBM50061909
Synonyms:4-Methyl-N-(4-p-tolyl-thiazol-2-yl)-benzenesulfonamide | CHEMBL138960
TypeSmall organic molecule
Emp. Form.C17H16N2O2S2
Mol. Mass.344.451
SMILESCc1ccc(cc1)-c1csc(NS(=O)(=O)c2ccc(C)cc2)n1