Reaction Details
TargetKynurenine 3-monooxygenase
LigandBDBM50061920
Substrate/Competitorn/a
Meas. Tech.ChEMBL_91740 (CHEMBL702202)
IC50 5770±n/a nM
Citation Röver, SCesura, AMHuguenin, PKettler, RSzente, A Synthesis and biochemical evaluation of N-(4-phenylthiazol-2-yl)benzenesulfonamides as high-affinity inhibitors of kynurenine 3-hydroxylase. J Med Chem40:4378-85 (1998) 
 
Kynurenine 3-monooxygenase
Name:Kynurenine 3-monooxygenase
Type:PROTEIN
Mol. Mass.:54371.88
Organism:Rattus norvegicus
Description:ChEMBL_1487468
Residue:478
BDBM50061920
NameBDBM50061920
Synonyms:4-(3-Nitro-phenyl)-4-oxo-butyric acid | CHEMBL138934
TypeSmall organic molecule
Emp. Form.C10H9NO5
Mol. Mass.223.1822
SMILESOC(=O)CCC(=O)c1cccc(c1)[N+]([O-])=O