Reaction Details
TargetReverse transcriptase/RNaseH
LigandBDBM50061986
Substrate/Competitorn/a
Meas. Tech.ChEMBL_195658 (CHEMBL800042)
IC50 800±n/a nM
Citation Qiu, YLKsebati, MBPtak, RGFan, BYBreitenbach, JMLin, JSCheng, YCKern, ERDrach, JCZemlicka, J (Z)- and (E)-2-((hydroxymethyl)cyclopropylidene)methyladenine and -guanine. New nucleoside analogues with a broad-spectrum antiviral activity. J Med Chem41:10-23 (1998) 
 
Reverse transcriptase/RNaseH
Name:Reverse transcriptase/RNaseH
Type:PROTEIN
Mol. Mass.:65229.15
Organism:Human immunodeficiency virus 1
Description:ChEMBL_1473730
Residue:566
BDBM50061986
NameBDBM50061986
Synonyms:CHEMBL305612 {(2Z)-2-[(6-amino-9H-purin-9-yl)methylene]cyclopropyl}methanol | {2-[1-(6-Amino-purin-9-yl)-meth-(Z)-ylidene]-cyclopropyl}-methanol
TypeSmall organic molecule
Emp. Form.C10H11N5O
Mol. Mass.217.2272
SMILESNc1ncnc2n(\C=C3\CC3CO)cnc12