Reaction Details
TargetCyclic AMP-dependent transcription factor ATF-1
LigandBDBM50062660
Substrate/Competitorn/a
Meas. Tech.ChEMBL_27877 (CHEMBL640575)
IC50>10000±n/a nM
Citation Sullivan, RWBigam, CGErdman, PEPalanki, MSAnderson, DWGoldman, MERansone, LJSuto, MJ 2-Chloro-4-(trifluoromethyl)pyrimidine-5-N-(3',5'- bis(trifluoromethyl)phenyl)-carboxamide: a potent inhibitor of NF-kappa B- and AP-1-mediated gene expression identified using solution-phase combinatorial chemistry. J Med Chem41:413-9 (1998) 
 
Cyclic AMP-dependent transcription factor ATF-1
Name:Cyclic AMP-dependent transcription factor ATF-1
Type:PROTEIN
Mol. Mass.:29236.24
Organism:Homo sapiens (Human)
Description:ChEMBL_27877
Residue:271
BDBM50062660
NameBDBM50062660
Synonyms:2-Methoxy-4-trifluoromethyl-pyrimidine-5-carboxylic acid (3,5-dichloro-phenyl)-amide | CHEMBL134522
TypeSmall organic molecule
Emp. Form.C13H8Cl2F3N3O2
Mol. Mass.366.123
SMILESCOc1ncc(C(=O)Nc2cc(Cl)cc(Cl)c2)c(n1)C(F)(F)F