Reaction Details
TargetNuclear factor NF-kappa-B p105 subunit
LigandBDBM50062662
Substrate/Competitorn/a
Meas. Tech.ChEMBL_143916 (CHEMBL752719)
IC50>10000±n/a nM
Citation Sullivan, RWBigam, CGErdman, PEPalanki, MSAnderson, DWGoldman, MERansone, LJSuto, MJ 2-Chloro-4-(trifluoromethyl)pyrimidine-5-N-(3',5'- bis(trifluoromethyl)phenyl)-carboxamide: a potent inhibitor of NF-kappa B- and AP-1-mediated gene expression identified using solution-phase combinatorial chemistry. J Med Chem41:413-9 (1998) 
 
Nuclear factor NF-kappa-B p105 subunit
Name:Nuclear factor NF-kappa-B p105 subunit
Type:Protein
Mol. Mass.:105329.57
Organism:Homo sapiens (Human)
Description:P19838
Residue:968
BDBM50062662
NameBDBM50062662
Synonyms:2-Cyclohexylamino-4-trifluoromethyl-pyrimidine-5-carboxylic acid (3,5-dichloro-phenyl)-amide | CHEMBL134876
TypeSmall organic molecule
Emp. Form.C18H17Cl2F3N4O
Mol. Mass.433.255
SMILESFC(F)(F)c1nc(NC2CCCCC2)ncc1C(=O)Nc1cc(Cl)cc(Cl)c1