Reaction Details
TargetCyclic AMP-dependent transcription factor ATF-1
LigandBDBM50062667
Substrate/Competitorn/a
Meas. Tech.ChEMBL_27877 (CHEMBL640575)
IC50>10000±n/a nM
Citation Sullivan, RWBigam, CGErdman, PEPalanki, MSAnderson, DWGoldman, MERansone, LJSuto, MJ 2-Chloro-4-(trifluoromethyl)pyrimidine-5-N-(3',5'- bis(trifluoromethyl)phenyl)-carboxamide: a potent inhibitor of NF-kappa B- and AP-1-mediated gene expression identified using solution-phase combinatorial chemistry. J Med Chem41:413-9 (1998) 
 
Cyclic AMP-dependent transcription factor ATF-1
Name:Cyclic AMP-dependent transcription factor ATF-1
Type:PROTEIN
Mol. Mass.:29236.24
Organism:Homo sapiens (Human)
Description:ChEMBL_27877
Residue:271
BDBM50062667
NameBDBM50062667
Synonyms:2-Chloro-4-trifluoromethyl-pyrimidine-5-carboxylic acid (2,6-dimethyl-phenyl)-amide | CHEMBL335703
TypeSmall organic molecule
Emp. Form.C14H11ClF3N3O
Mol. Mass.329.705
SMILESCc1cccc(C)c1NC(=O)c1cnc(Cl)nc1C(F)(F)F