Reaction Details
TargetSteroid 17-alpha-hydroxylase/17,20 lyase
LigandBDBM50063479
Substrate/Competitorn/a
Meas. Tech.ChEMBL_50384 (CHEMBL662840)
Ki 8±n/a nM
Citation Njar, VCKato, KNnane, IPGrigoryev, DNLong, BJBrodie, AM Novel 17-azolyl steroids, potent inhibitors of human cytochrome 17 alpha-hydroxylase-C17,20-lyase (P450(17) alpha): potential agents for the treatment of prostate cancer. J Med Chem41:902-12 (1998) 
 
Steroid 17-alpha-hydroxylase/17,20 lyase
Name:Steroid 17-alpha-hydroxylase/17,20 lyase
Type:Enzyme
Mol. Mass.:57382.42
Organism:Homo sapiens (Human)
Description:E.coli expressing human CYP17
Residue:508
BDBM50063479
NameBDBM50063479
Synonyms:(10R,13S)-10,13-Dimethyl-17-[1,2,3]triazol-1-yl-1,2,6,7,8,9,10,11,12,13,14,15-dodecahydro-cyclopenta[a]phenanthren-3-one | CHEMBL78003
TypeSmall organic molecule
Emp. Form.C21H27N3O
Mol. Mass.337.4586
SMILESC[C@]12CCC3C(CCC4=CC(=O)CC[C@]34C)C1CC=C2n1ccnn1