Reaction Details
TargetReverse transcriptase/RNaseH
LigandBDBM50063937
Substrate/Competitorn/a
Meas. Tech.ChEMBL_197122 (CHEMBL801612)
IC50>100000±n/a nM
Citation Porcari, ARDevivar, RVKucera, LSDrach, JCTownsend, LB Design, synthesis, and antiviral evaluations of 1-(substituted benzyl)-2-substituted-5,6-dichlorobenzimidazoles as nonnucleoside analogues of 2,5,6-trichloro-1-(beta-D-ribofuranosyl)benzimidazole. J Med Chem41:1252-62 (1998) 
 
Reverse transcriptase/RNaseH
Name:Reverse transcriptase/RNaseH
Type:PROTEIN
Mol. Mass.:65229.15
Organism:Human immunodeficiency virus 1
Description:ChEMBL_1473730
Residue:566
BDBM50063937
NameBDBM50063937
Synonyms:2-Bromo-5,6-dichloro-1-(4-methoxy-benzyl)-1H-benzoimidazole | CHEMBL276979
TypeSmall organic molecule
Emp. Form.C15H11BrCl2N2O
Mol. Mass.386.071
SMILESCOc1ccc(Cn2c(Br)nc3cc(Cl)c(Cl)cc23)cc1