Reaction Details
TargetReverse transcriptase/RNaseH
LigandBDBM50063958
Substrate/Competitorn/a
Meas. Tech.ChEMBL_197430 (CHEMBL802228)
IC50>100000±n/a nM
Citation Porcari, ARDevivar, RVKucera, LSDrach, JCTownsend, LB Design, synthesis, and antiviral evaluations of 1-(substituted benzyl)-2-substituted-5,6-dichlorobenzimidazoles as nonnucleoside analogues of 2,5,6-trichloro-1-(beta-D-ribofuranosyl)benzimidazole. J Med Chem41:1252-62 (1998) 
 
Reverse transcriptase/RNaseH
Name:Reverse transcriptase/RNaseH
Type:PROTEIN
Mol. Mass.:65229.15
Organism:Human immunodeficiency virus 1
Description:ChEMBL_1473730
Residue:566
BDBM50063958
NameBDBM50063958
Synonyms:2,5,6-Trichloro-1-(4-nitro-benzyl)-1H-benzoimidazole | CHEMBL279744
TypeSmall organic molecule
Emp. Form.C14H8Cl3N3O2
Mol. Mass.356.591
SMILES[O-][N+](=O)c1ccc(Cn2c(Cl)nc3cc(Cl)c(Cl)cc23)cc1