Reaction Details
TargetPlatelet-derived growth factor receptor alpha/beta
LigandBDBM3096
Substrate/Competitorn/a
Meas. Tech.ChEMBL_158357 (CHEMBL770468)
IC50 96±n/a nM
Citation Trumpp-Kallmeyer, SRubin, JRHumblet, CHamby, JMHollis Showalter, HD Development of a binding model to protein tyrosine kinases for substituted pyrido[2,3-d]pyrimidine inhibitors. J Med Chem41:1752-63 (1998) 
 
Platelet-derived growth factor receptor alpha/beta
Name:Platelet-derived growth factor receptor alpha/beta
Type:n/a
Mol. Mass.:n/a
Description:ASSAY_ID of EBI is 454
Components:This complex has 2 components.
Component 1
Name:Platelet-derived growth factor receptor beta
Synonyms:2.7.10.1 Beta-type platelet-derived growth factor receptor CD140b antigen PDGF-R-beta PDGFR-beta Pdgfr Pdgfrb Platelet-derived growth factor receptor | Platelet-derived growth factor receptor 1
Type:Enzyme
Mol. Mass.:122771.00
Organism:Mus musculus (mouse)
Description:P05622
Residue:1098
Component 2
Name:Platelet-derived growth factor receptor alpha
Synonyms:PGFRA_MOUSE Platelet-derived growth factor receptor
Type:PROTEIN
Mol. Mass.:122646.66
Organism:Mus musculus
Description:EBI_12628
Residue:1089
BDBM3096
NameBDBM3096
Synonyms:2-aminopyrido[2,3-d]pyrimidin-7(8H)-one deriv. 6-(2,6-dichlorophenyl)-2-({4-[2-(diethylamino)ethoxy]phenyl}amino)-8-methyl-7H,8H-pyrido[2,3-d]pyrimidin-7-one D3RKN_84 | PD166285
TypeSmall organic molecule
Emp. Form.C26H27Cl2N5O2
Mol. Mass.512.431
SMILESCCN(CC)CCOc1ccc(Nc2ncc3cc(-c4c(Cl)cccc4Cl)c(=O)n(C)c3n2)cc1