Reaction Details
TargetDNA gyrase subunit A/B
LigandBDBM50510289
Substrate/Competitorn/a
Meas. Tech.ChEMBL_1841327 (CHEMBL4341626)
IC50 1600±n/a nM
Citation Thalji, RKRaha, KAndreotti, DChecchia, ACui, HMeneghelli, GProfeta, RTonelli, FTommasi, SBakshi, TDonovan, BTHowells, AJain, SNixon, CQuinque, GMcCloskey, LBax, BDNeu, MChan, PFStavenger, RA Structure-guided design of antibacterials that allosterically inhibit DNA gyrase. Bioorg Med Chem Lett29:1407-1412 (2019) 
 
DNA gyrase subunit A/B
Name:DNA gyrase subunit A/B
Type:A2B2 tetramer
Mol. Mass.:n/a
Description:n/a
Components:This complex has 2 components.
Component 1
Name:DNA gyrase subunit A
Synonyms:DNA gyrase GYRA_ECOLI hisW parD
Type:Enzyme Subunit
Mol. Mass.:96935.15
Organism:Escherichia coli (strain K12)
Description:n/a
Residue:875
Component 2
Name:DNA gyrase subunit B
Synonyms:DNA gyrase subunit B GYRB_ECOLI acrB gyrB hisU parA | pcbA
Type:Enzyme Subunit
Mol. Mass.:89941.28
Organism:Escherichia coli (strain K12)
Description:P0AES6
Residue:804
BDBM50510289
NameBDBM50510289
Synonyms:CHEMBL4588294
TypeSmall organic molecule
Emp. Form.C21H18ClN3O
Mol. Mass.363.84
SMILESNC[C@H](Oc1n[nH]c2ccc(cc12)-c1ccccc1Cl)c1ccccc1