Reaction Details
TargetSodium channel protein type 5 subunit alpha
LigandBDBM50510288
Substrate/Competitorn/a
Meas. Tech.ChEMBL_1841340 (CHEMBL4341639)
IC50 22000±n/a nM
Citation Thalji, RKRaha, KAndreotti, DChecchia, ACui, HMeneghelli, GProfeta, RTonelli, FTommasi, SBakshi, TDonovan, BTHowells, AJain, SNixon, CQuinque, GMcCloskey, LBax, BDNeu, MChan, PFStavenger, RA Structure-guided design of antibacterials that allosterically inhibit DNA gyrase. Bioorg Med Chem Lett29:1407-1412 (2019) 
 
Sodium channel protein type 5 subunit alpha
Name:Sodium channel protein type 5 subunit alpha
Type:Enzyme
Mol. Mass.:226908.60
Organism:Homo sapiens (Human)
Description:Q14524
Residue:2016
BDBM50510288
NameBDBM50510288
Synonyms:CHEMBL4445556
TypeSmall organic molecule
Emp. Form.C21H17ClN2O2
Mol. Mass.364.825
SMILESNC[C@H](Oc1noc2ccc(cc12)-c1ccccc1Cl)c1ccccc1