Reaction Details
TargetSodium channel protein type 5 subunit alpha
LigandBDBM50510292
Substrate/Competitorn/a
Meas. Tech.ChEMBL_1841340 (CHEMBL4341639)
IC50 24000±n/a nM
Citation Thalji, RKRaha, KAndreotti, DChecchia, ACui, HMeneghelli, GProfeta, RTonelli, FTommasi, SBakshi, TDonovan, BTHowells, AJain, SNixon, CQuinque, GMcCloskey, LBax, BDNeu, MChan, PFStavenger, RA Structure-guided design of antibacterials that allosterically inhibit DNA gyrase. Bioorg Med Chem Lett29:1407-1412 (2019) 
 
Sodium channel protein type 5 subunit alpha
Name:Sodium channel protein type 5 subunit alpha
Type:Enzyme
Mol. Mass.:226908.60
Organism:Homo sapiens (Human)
Description:Q14524
Residue:2016
BDBM50510292
NameBDBM50510292
Synonyms:CHEMBL4471339
TypeSmall organic molecule
Emp. Form.C20H16ClN3O2
Mol. Mass.365.813
SMILESNC[C@H](Oc1noc2ncc(cc12)-c1ccccc1Cl)c1ccccc1