Reaction Details
TargetPotassium voltage-gated channel subfamily H member 2
LigandBDBM50510294
Substrate/Competitorn/a
Meas. Tech.ChEMBL_1841342 (CHEMBL4341641)
IC50 9500±n/a nM
Citation Thalji, RKRaha, KAndreotti, DChecchia, ACui, HMeneghelli, GProfeta, RTonelli, FTommasi, SBakshi, TDonovan, BTHowells, AJain, SNixon, CQuinque, GMcCloskey, LBax, BDNeu, MChan, PFStavenger, RA Structure-guided design of antibacterials that allosterically inhibit DNA gyrase. Bioorg Med Chem Lett29:1407-1412 (2019) 
 
Potassium voltage-gated channel subfamily H member 2
Name:Potassium voltage-gated channel subfamily H member 2
Type:Multi-pass membrane protein
Mol. Mass.:126672.65
Organism:Homo sapiens (Human)
Description:Q12809
Residue:1159
BDBM50510294
NameBDBM50510294
Synonyms:CHEMBL4592805
TypeSmall organic molecule
Emp. Form.C22H19ClN4O2
Mol. Mass.406.865
SMILESNC(=N)NC[C@H](Oc1noc2ccc(cc12)-c1ccccc1Cl)c1ccccc1