Reaction Details
TargetDNA topoisomerase 2-alpha
LigandBDBM50510288
Substrate/Competitorn/a
Meas. Tech.ChEMBL_1841339 (CHEMBL4341638)
IC50 210000±n/a nM
Citation Thalji, RKRaha, KAndreotti, DChecchia, ACui, HMeneghelli, GProfeta, RTonelli, FTommasi, SBakshi, TDonovan, BTHowells, AJain, SNixon, CQuinque, GMcCloskey, LBax, BDNeu, MChan, PFStavenger, RA Structure-guided design of antibacterials that allosterically inhibit DNA gyrase. Bioorg Med Chem Lett29:1407-1412 (2019) 
 
DNA topoisomerase 2-alpha
Name:DNA topoisomerase 2-alpha
Type:Protein
Mol. Mass.:174415.30
Organism:Homo sapiens (Human)
Description:P11388
Residue:1531
BDBM50510288
NameBDBM50510288
Synonyms:CHEMBL4445556
TypeSmall organic molecule
Emp. Form.C21H17ClN2O2
Mol. Mass.364.825
SMILESNC[C@H](Oc1noc2ccc(cc12)-c1ccccc1Cl)c1ccccc1