Reaction Details
TargetPotassium voltage-gated channel subfamily H member 2
LigandBDBM50510295
Substrate/Competitorn/a
Meas. Tech.ChEMBL_1841342 (CHEMBL4341641)
IC50 6700±n/a nM
Citation Thalji, RKRaha, KAndreotti, DChecchia, ACui, HMeneghelli, GProfeta, RTonelli, FTommasi, SBakshi, TDonovan, BTHowells, AJain, SNixon, CQuinque, GMcCloskey, LBax, BDNeu, MChan, PFStavenger, RA Structure-guided design of antibacterials that allosterically inhibit DNA gyrase. Bioorg Med Chem Lett29:1407-1412 (2019) 
 
Potassium voltage-gated channel subfamily H member 2
Name:Potassium voltage-gated channel subfamily H member 2
Type:Multi-pass membrane protein
Mol. Mass.:126672.65
Organism:Homo sapiens (Human)
Description:Q12809
Residue:1159
BDBM50510295
NameBDBM50510295
Synonyms:CHEMBL4443422
TypeSmall organic molecule
Emp. Form.C20H19ClN2OS
Mol. Mass.370.896
SMILESCc1sc(cc1C(=O)N[C@@H](CN)c1ccccc1)-c1ccccc1Cl