Reaction Details
TargetSodium channel protein type 5 subunit alpha
LigandBDBM50510295
Substrate/Competitorn/a
Meas. Tech.ChEMBL_1841340 (CHEMBL4341639)
IC50 13000±n/a nM
Citation Thalji, RKRaha, KAndreotti, DChecchia, ACui, HMeneghelli, GProfeta, RTonelli, FTommasi, SBakshi, TDonovan, BTHowells, AJain, SNixon, CQuinque, GMcCloskey, LBax, BDNeu, MChan, PFStavenger, RA Structure-guided design of antibacterials that allosterically inhibit DNA gyrase. Bioorg Med Chem Lett29:1407-1412 (2019) 
 
Sodium channel protein type 5 subunit alpha
Name:Sodium channel protein type 5 subunit alpha
Type:Enzyme
Mol. Mass.:226908.60
Organism:Homo sapiens (Human)
Description:Q14524
Residue:2016
BDBM50510295
NameBDBM50510295
Synonyms:CHEMBL4443422
TypeSmall organic molecule
Emp. Form.C20H19ClN2OS
Mol. Mass.370.896
SMILESCc1sc(cc1C(=O)N[C@@H](CN)c1ccccc1)-c1ccccc1Cl