Reaction Details
TargetPotassium voltage-gated channel subfamily H member 2
LigandBDBM50510288
Substrate/Competitorn/a
Meas. Tech.ChEMBL_1841342 (CHEMBL4341641)
IC50 23000±n/a nM
Citation Thalji, RKRaha, KAndreotti, DChecchia, ACui, HMeneghelli, GProfeta, RTonelli, FTommasi, SBakshi, TDonovan, BTHowells, AJain, SNixon, CQuinque, GMcCloskey, LBax, BDNeu, MChan, PFStavenger, RA Structure-guided design of antibacterials that allosterically inhibit DNA gyrase. Bioorg Med Chem Lett29:1407-1412 (2019) 
 
Potassium voltage-gated channel subfamily H member 2
Name:Potassium voltage-gated channel subfamily H member 2
Type:Multi-pass membrane protein
Mol. Mass.:126672.65
Organism:Homo sapiens (Human)
Description:Q12809
Residue:1159
BDBM50510288
NameBDBM50510288
Synonyms:CHEMBL4445556
TypeSmall organic molecule
Emp. Form.C21H17ClN2O2
Mol. Mass.364.825
SMILESNC[C@H](Oc1noc2ccc(cc12)-c1ccccc1Cl)c1ccccc1