Reaction Details
TargetPlatelet-activating factor receptor
LigandBDBM50408421
Substrate/Competitorn/a
Meas. Tech.ChEMBL_158343 (CHEMBL768487)
IC50 2±n/a nM
Citation Cai, XScannell, RTYaeger, DHussoin, MSKillian, DBQian, CEckman, JHwang, SBLibertine-Garahan, LYeh, CGIp, SHShen, TY (+/-)-trans-2-[3-methoxy-4-(4-chlorophenylthioethoxy)-5-(N-methyl-N- hydroxyureidyl)methylphenyl]-5-(3,4, 5-trimethoxyphenyl)tetrahydrofuran (CMI-392), a potent dual 5-lipoxygenase inhibitor and platelet-activating factor receptor antagonist. J Med Chem41:1970-9 (1998) 
 
Platelet-activating factor receptor
Name:Platelet-activating factor receptor
Type:Enzyme Catalytic Domain
Mol. Mass.:39219.60
Organism:Homo sapiens (Human)
Description:PAF Platelet activating factor PTAFR HUMAN::P25105
Residue:342
BDBM50408421
NameBDBM50408421
Synonyms:CHEMBL2113725
TypeSmall organic molecule
Emp. Form.C33H38F4N2O8S
Mol. Mass.698.722
SMILESCCCCN(O)C(=O)Nc1cc(cc(OC)c1OCCSc1c(F)c(F)cc(F)c1F)[C@@H]1CC[C@H](O1)c1cc(OC)c(OC)c(OC)c1