Reaction Details
TargetGlutathione S-transferase kappa 1
LigandBDBM50064881
Substrate/Competitorn/a
Meas. Tech.ChEMBL_72308 (CHEMBL686166)
IC50 1800000±n/a nM
Citation Klotz, PSlaoui-Hasnaoui, ABanères, JLDuckert, JFRossi, JCKerbal, A Synthesis and glutathione S-transferase structure-affinity relationships of nonpeptide and peptidase-stable glutathione analogues. J Med Chem41:2278-88 (1998) 
 
Glutathione S-transferase kappa 1
Name:Glutathione S-transferase kappa 1
Type:PROTEIN
Mol. Mass.:25502.12
Organism:Homo sapiens (Human)
Description:ChEMBL_72308
Residue:226
BDBM50064881
NameBDBM50064881
Synonyms:4-Mercaptomethyl-decanedioic acid | CHEMBL76285
TypeSmall organic molecule
Emp. Form.C11H20O4S
Mol. Mass.248.339
SMILESOC(=O)CCCCCC(CS)CCC(O)=O