Reaction Details
TargetGlutathione S-transferase kappa 1
LigandBDBM50422268
Substrate/Competitorn/a
Meas. Tech.ChEMBL_72308 (CHEMBL686166)
IC50 20±n/a nM
Citation Klotz, PSlaoui-Hasnaoui, ABanères, JLDuckert, JFRossi, JCKerbal, A Synthesis and glutathione S-transferase structure-affinity relationships of nonpeptide and peptidase-stable glutathione analogues. J Med Chem41:2278-88 (1998) 
 
Glutathione S-transferase kappa 1
Name:Glutathione S-transferase kappa 1
Type:PROTEIN
Mol. Mass.:25502.12
Organism:Homo sapiens (Human)
Description:ChEMBL_72308
Residue:226
BDBM50422268
NameBDBM50422268
Synonyms:GLUTATHIONE | GSH
TypeSmall organic molecule
Emp. Form.C10H17N3O6S
Mol. Mass.307.323
SMILESN[C@@H](CCC(=O)N[C@@H](CS)C(=O)NCC(O)=O)C(O)=O