Reaction Details
TargetSigma non-opioid intracellular receptor 1
LigandBDBM50064962
Substrate/Competitorn/a
Meas. Tech.ChEMBL_200965 (CHEMBL802053)
Ki 2.45±n/a nM
Citation Huang, YHammond, PSWhirrett, BRKuhner, RJWu, LChilders, SRMach, RH Synthesis and quantitative structure-activity relationships of N-(1-benzylpiperidin-4-yl)phenylacetamides and related analogues as potent and selective sigma1 receptor ligands. J Med Chem41:2361-70 (1998) 
 
Sigma non-opioid intracellular receptor 1
Name:Sigma non-opioid intracellular receptor 1
Type:Enzyme Catalytic Domain
Mol. Mass.:25124.85
Organism:Homo sapiens (Human)
Description:Q99720
Residue:223
BDBM50064962
NameBDBM50064962
Synonyms:CHEMBL306768 | N-(1-Benzyl-piperidin-4-yl)-2-(3-fluoro-phenyl)-acetamide
TypeSmall organic molecule
Emp. Form.C20H23FN2O
Mol. Mass.326.4078
SMILESFc1cccc(CC(=O)NC2CCN(Cc3ccccc3)CC2)c1