Reaction Details
TargetReceptor tyrosine-protein kinase erbB-2
LigandBDBM50065304
Substrate/Competitorn/a
Meas. Tech.ChEMBL_78751 (CHEMBL686676)
IC50>100000±n/a nM
Citation Sun, LTran, NTang, FApp, HHirth, PMcMahon, GTang, C Synthesis and biological evaluations of 3-substituted indolin-2-ones: a novel class of tyrosine kinase inhibitors that exhibit selectivity toward particular receptor tyrosine kinases. J Med Chem41:2588-603 (1998) 
 
Receptor tyrosine-protein kinase erbB-2
Name:Receptor tyrosine-protein kinase erbB-2
Type:n/a
Mol. Mass.:137894.47
Organism:Homo sapiens (Human)
Description:P04626
Residue:1255
BDBM50065304
NameBDBM50065304
Synonyms:3-[1-(4-Hydroxy-phenyl)-meth-(Z)-ylidene]-1,3-dihydro-indol-2-one | CHEMBL313578
TypeSmall organic molecule
Emp. Form.C15H11NO2
Mol. Mass.237.2533
SMILESOc1ccc(\C=C2/C(=O)Nc3ccccc23)cc1