Reaction Details
TargetVascular endothelial growth factor receptor 1
LigandBDBM50065304
Substrate/Competitorn/a
Meas. Tech.ChEMBL_214499 (CHEMBL818398)
IC50 2700±n/a nM
Citation Sun, LTran, NTang, FApp, HHirth, PMcMahon, GTang, C Synthesis and biological evaluations of 3-substituted indolin-2-ones: a novel class of tyrosine kinase inhibitors that exhibit selectivity toward particular receptor tyrosine kinases. J Med Chem41:2588-603 (1998) 
 
Vascular endothelial growth factor receptor 1
Name:Vascular endothelial growth factor receptor 1
Type:PROTEIN
Mol. Mass.:149906.69
Organism:Mus musculus
Description:ChEMBL_820931
Residue:1333
BDBM50065304
NameBDBM50065304
Synonyms:3-[1-(4-Hydroxy-phenyl)-meth-(Z)-ylidene]-1,3-dihydro-indol-2-one | CHEMBL313578
TypeSmall organic molecule
Emp. Form.C15H11NO2
Mol. Mass.237.2533
SMILESOc1ccc(\C=C2/C(=O)Nc3ccccc23)cc1