Reaction Details
TargetGenome polyprotein
LigandBDBM50065590
Substrate/Competitorn/a
Meas. Tech.ChEMBL_160899 (CHEMBL771795)
Ki 36±n/a nM
Citation Webber, SEOkano, KLittle, TLReich, SHXin, YFuhrman, SAMatthews, DALove, RAHendrickson, TFPatick, AKMeador, JWFerre, RABrown, ELFord, CEBinford, SLWorland, ST Tripeptide aldehyde inhibitors of human rhinovirus 3C protease: design, synthesis, biological evaluation, and cocrystal structure solution of P1 glutamine isosteric replacements. J Med Chem41:2786-805 (1998) 
 
Genome polyprotein
Name:Genome polyprotein
Type:PROTEIN
Mol. Mass.:44361.04
Organism:Human rhinovirus B
Description:ChEMBL_158953
Residue:401
BDBM50065590
NameBDBM50065590
Synonyms:((S)-1-{(S)-1-[(S)-1-(Acetylamino-methyl)-2-oxo-ethylcarbamoyl]-2-phenyl-ethylcarbamoyl}-3-methyl-butyl)-carbamic acid benzyl ester CHEMBL95007
TypeSmall organic molecule
Emp. Form.C28H36N4O6
Mol. Mass.524.6086
SMILESCC(C)C[C@H](NC(=O)OCc1ccccc1)C(=O)N[C@@H](Cc1ccccc1)C(=O)N[C@@H](CNC(C)=O)C=O