Reaction Details
TargetDiacylglycerol O-acyltransferase 1
LigandBDBM50399710
Substrate/Competitorn/a
Meas. Tech.ChEMBL_1843867 (CHEMBL4344294)
IC50>300000±n/a nM
Citation Romero, FAJones, CTXu, YFenaux, MHalcomb, RL The Race to Bash NASH: Emerging Targets and Drug Development in a Complex Liver Disease. J Med Chem63:5031-5073 (2020) 
 
Diacylglycerol O-acyltransferase 1
Name:Diacylglycerol O-acyltransferase 1
Type:Protein
Mol. Mass.:55297.82
Organism:Homo sapiens (Human)
Description:O75907
Residue:488
BDBM50399710
NameBDBM50399710
Synonyms:CHEMBL2178953
TypeSmall organic molecule
Emp. Form.C21H25N3O3
Mol. Mass.367.4415
SMILESCc1nc(C)c(nc1C(N)=O)-c1ccc(cc1)[C@H]1CC[C@H](CC(O)=O)CC1