Reaction Details
TargetGlycogen phosphorylase, liver form
LigandBDBM50065944
Substrate/Competitorn/a
Meas. Tech.ChEMBL_99040 (CHEMBL712593)
IC50 110±n/a nM
Citation Hoover, DJLefkowitz-Snow, SBurgess-Henry, JLMartin, WHArmento, SJStock, IAMcPherson, RKGenereux, PEGibbs, EMTreadway, JL Indole-2-carboxamide inhibitors of human liver glycogen phosphorylase. J Med Chem41:2934-8 (1998) 
 
Glycogen phosphorylase, liver form
Name:Glycogen phosphorylase, liver form
Type:Homodimer
Mol. Mass.:97153.98
Organism:Homo sapiens (Human)
Description:Dimers associate into a tetramer to form the enzymatically active phosphorylase A.
Residue:847
BDBM50065944
NameBDBM50065944
Synonyms:5-Bromo-1H-indole-2-carboxylic acid ((S)-1-dimethylcarbamoyl-2-phenyl-ethyl)-amide | CHEMBL318910
TypeSmall organic molecule
Emp. Form.C20H20BrN3O2
Mol. Mass.414.296
SMILESCN(C)C(=O)[C@H](Cc1ccccc1)NC(=O)c1cc2cc(Br)ccc2[nH]1