Reaction Details
TargetGlycogen phosphorylase, liver form
LigandBDBM50065962
Substrate/Competitorn/a
Meas. Tech.ChEMBL_99040 (CHEMBL712593)
IC50 170±n/a nM
Citation Hoover, DJLefkowitz-Snow, SBurgess-Henry, JLMartin, WHArmento, SJStock, IAMcPherson, RKGenereux, PEGibbs, EMTreadway, JL Indole-2-carboxamide inhibitors of human liver glycogen phosphorylase. J Med Chem41:2934-8 (1998) 
 
Glycogen phosphorylase, liver form
Name:Glycogen phosphorylase, liver form
Type:Homodimer
Mol. Mass.:97153.98
Organism:Homo sapiens (Human)
Description:Dimers associate into a tetramer to form the enzymatically active phosphorylase A.
Residue:847
BDBM50065962
NameBDBM50065962
Synonyms:5-Fluoro-1H-indole-2-carboxylic acid ((1S,2R)-1-benzyl-2-dimethylcarbamoyl-2-hydroxy-ethyl)-amide | CHEMBL99597
TypeSmall organic molecule
Emp. Form.C21H22FN3O3
Mol. Mass.383.4161
SMILESCN(C)C(=O)[C@H](O)[C@H](Cc1ccccc1)NC(=O)c1cc2cc(F)ccc2[nH]1