Reaction Details
TargetSerine protease 1
LigandBDBM50066639
Substrate/Competitorn/a
Meas. Tech.ChEMBL_212528 (CHEMBL817592)
Ki 330±n/a nM
Citation Phillips, GBBuckman, BODavey, DDEagen, KAGuilford, WJHinchman, JHo, EKoovakkat, SLiang, ALight, DRMohan, RNg, HPPost, JMShaw, KJSmith, DSubramanyam, BSullivan, METrinh, LVergona, RWalters, JWhite, KWhitlow, MWu, SXu, WMorrissey, MM Discovery of N-[2-[5-[Amino(imino)methyl]-2-hydroxyphenoxy]-3, 5-difluoro-6-[3-(4, 5-dihydro-1-methyl-1H-imidazol-2-yl)phenoxy]pyridin-4-yl]-N-methylgl y cine (ZK-807834): a potent, selective, and orally active inhibitor of the blood coagulation enzyme factor Xa. J Med Chem41:3557-62 (1998) 
 
Serine protease 1
Name:Serine protease 1
Type:Enzyme
Mol. Mass.:25790.52
Organism:Bos taurus (bovine)
Description:P00760
Residue:246
BDBM50066639
NameBDBM50066639
Synonyms:(2S,4R)-4-{2-(5-Carbamimidoyl-2-hydroxy-phenoxy)-3,5-difluoro-6-[3-(1-methyl-4,5-dihydro-1H-imidazol-2-yl)-phenoxy]-pyridin-4-yloxy}-pyrrolidine-2-carboxylic acid ethyl ester | CHEMBL331213
TypeSmall organic molecule
Emp. Form.C29H30F2N6O6
Mol. Mass.596.5819
SMILESCCOC(=O)[C@@H]1C[C@H](CN1)Oc1c(F)c(Oc2cccc(c2)C2=NCCN2C)nc(Oc2cc(ccc2O)C(N)=N)c1F