Reaction Details
TargetCannabinoid receptor 2
LigandBDBM50066705
Substrate/Competitorn/a
Meas. Tech.ChEMBL_46997 (CHEMBL658966)
Ki 1.4±n/a nM
Citation Drake, DJJensen, RSBusch-Petersen, JKawakami, JKConcepcion Fernandez-Garcia, MFan, PMakriyannis, ATius, MA Classical/nonclassical hybrid cannabinoids: southern aliphatic chain-functionalized C-6beta methyl, ethyl, and propyl analogues. J Med Chem41:3596-608 (1998) 
 
Cannabinoid receptor 2
Name:Cannabinoid receptor 2
Type:Enzyme Catalytic Domain
Mol. Mass.:38220.43
Organism:MOUSE
Description:P47936
Residue:347
BDBM50066705
NameBDBM50066705
Synonyms:(6R,6aR,9R,10aR)-3-(1,1-Dimethyl-heptyl)-6,9-bis-hydroxymethyl-6-methyl-6a,7,8,9,10,10a-hexahydro-6H-benzo[c]chromen-1-ol | CHEMBL120778
TypeSmall organic molecule
Emp. Form.C25H40O4
Mol. Mass.404.5827
SMILESCCCCCCC(C)(C)c1cc(O)c2[C@@H]3C[C@H](CO)CC[C@H]3[C@](C)(CO)Oc2c1