Reaction Details
TargetCannabinoid receptor 1
LigandBDBM50066706
Substrate/Competitorn/a
Meas. Tech.ChEMBL_46647 (CHEMBL658902)
Ki 2.8±n/a nM
Citation Drake, DJJensen, RSBusch-Petersen, JKawakami, JKConcepcion Fernandez-Garcia, MFan, PMakriyannis, ATius, MA Classical/nonclassical hybrid cannabinoids: southern aliphatic chain-functionalized C-6beta methyl, ethyl, and propyl analogues. J Med Chem41:3596-608 (1998) 
 
Cannabinoid receptor 1
Name:Cannabinoid receptor 1
Type:G Protein-Coupled Receptor (GPCR)
Mol. Mass.:52856.55
Organism:Rattus norvegicus (rat)
Description:P20272
Residue:473
BDBM50066706
NameBDBM50066706
Synonyms:(6S,6aR,9R,10aR)-3-(1,1-Dimethyl-heptyl)-6-(2-hydroxy-ethyl)-9-hydroxymethyl-6-methyl-6a,7,8,9,10,10a-hexahydro-6H-benzo[c]chromen-1-ol | CHEMBL119914
TypeSmall organic molecule
Emp. Form.C26H42O4
Mol. Mass.418.6093
SMILESCCCCCCC(C)(C)c1cc(O)c2[C@@H]3C[C@H](CO)CC[C@H]3[C@](C)(CCO)Oc2c1