Reaction Details
TargetCannabinoid receptor 2
LigandBDBM50066711
Substrate/Competitorn/a
Meas. Tech.ChEMBL_46997 (CHEMBL658966)
Ki 38.9±n/a nM
Citation Drake, DJJensen, RSBusch-Petersen, JKawakami, JKConcepcion Fernandez-Garcia, MFan, PMakriyannis, ATius, MA Classical/nonclassical hybrid cannabinoids: southern aliphatic chain-functionalized C-6beta methyl, ethyl, and propyl analogues. J Med Chem41:3596-608 (1998) 
 
Cannabinoid receptor 2
Name:Cannabinoid receptor 2
Type:Enzyme Catalytic Domain
Mol. Mass.:38220.43
Organism:MOUSE
Description:P47936
Residue:347
BDBM50066711
NameBDBM50066711
Synonyms:(6S,6aR,9R,10aR)-3-(1,1-Dimethyl-heptyl)-9-hydroxymethyl-6-methyl-6-propyl-6a,7,8,9,10,10a-hexahydro-6H-benzo[c]chromen-1-ol | CHEMBL262559
TypeSmall organic molecule
Emp. Form.C27H44O3
Mol. Mass.416.6365
SMILESCCCCCCC(C)(C)c1cc(O)c2[C@@H]3C[C@H](CO)CC[C@H]3[C@](C)(CCC)Oc2c1