Reaction Details
TargetRetinoic acid receptor alpha
LigandBDBM50066904
Substrate/Competitorn/a
Meas. Tech.ChEMBL_197392 (CHEMBL799711)
EC50 1100±n/a nM
Citation Benbrook, DMSubramanian, SGale, JBLiu, SBrown, CWBoehm, MFBerlin, KD Synthesis and characterization of heteroarotinoids demonstrate structure specificity relationships. J Med Chem41:3753-7 (1998) 
 
Retinoic acid receptor alpha
Name:Retinoic acid receptor alpha
Type:PROTEIN
Mol. Mass.:50778.87
Organism:Homo sapiens (Human)
Description:ChEMBL_1466191
Residue:462
BDBM50066904
NameBDBM50066904
Synonyms:4-[(E)-2-(4,4-Dimethyl-chroman-6-yl)-propenyl]-benzoic acid methyl ester CHEMBL34464
TypeSmall organic molecule
Emp. Form.C22H24O3
Mol. Mass.336.4242
SMILESCOC(=O)c1ccc(\C=C(/C)c2ccc3OCCC(C)(C)c3c2)cc1