Reaction Details
TargetRetinoic acid receptor beta
LigandBDBM50066903
Substrate/Competitorn/a
Meas. Tech.ChEMBL_195481 (CHEMBL798903)
EC50 430±n/a nM
Citation Benbrook, DMSubramanian, SGale, JBLiu, SBrown, CWBoehm, MFBerlin, KD Synthesis and characterization of heteroarotinoids demonstrate structure specificity relationships. J Med Chem41:3753-7 (1998) 
 
Retinoic acid receptor beta
Name:Retinoic acid receptor beta
Type:PROTEIN
Mol. Mass.:50498.70
Organism:Homo sapiens (Human)
Description:ChEMBL_1458015
Residue:455
BDBM50066903
NameBDBM50066903
Synonyms:4-[(E)-2-(3,3-Dimethyl-2,3-dihydro-benzofuran-5-yl)-propenyl]-benzoic acid methyl ester CHEMBL37672
TypeSmall organic molecule
Emp. Form.C21H22O3
Mol. Mass.322.3976
SMILESCOC(=O)c1ccc(\C=C(/C)c2ccc3OCC(C)(C)c3c2)cc1