Reaction Details
TargetRetinoic acid receptor beta
LigandBDBM50066901
Substrate/Competitorn/a
Meas. Tech.ChEMBL_195481 (CHEMBL798903)
EC50 1200±n/a nM
Citation Benbrook, DMSubramanian, SGale, JBLiu, SBrown, CWBoehm, MFBerlin, KD Synthesis and characterization of heteroarotinoids demonstrate structure specificity relationships. J Med Chem41:3753-7 (1998) 
 
Retinoic acid receptor beta
Name:Retinoic acid receptor beta
Type:PROTEIN
Mol. Mass.:50498.70
Organism:Homo sapiens (Human)
Description:ChEMBL_1458015
Residue:455
BDBM50066901
NameBDBM50066901
Synonyms:(2E,4E,6E)-7-(3,3-Dimethyl-2,3-dihydro-benzo[b]thiophen-5-yl)-3-methyl-octa-2,4,6-trienoic acid | CHEMBL330998
TypeSmall organic molecule
Emp. Form.C19H22O2S
Mol. Mass.314.442
SMILESC\C(\C=C\C=C(/C)c1ccc2SCC(C)(C)c2c1)=C/C(O)=O