Reaction Details
TargetRetinoic acid receptor beta
LigandBDBM50066907
Substrate/Competitorn/a
Meas. Tech.ChEMBL_195481 (CHEMBL798903)
EC50 18±n/a nM
Citation Benbrook, DMSubramanian, SGale, JBLiu, SBrown, CWBoehm, MFBerlin, KD Synthesis and characterization of heteroarotinoids demonstrate structure specificity relationships. J Med Chem41:3753-7 (1998) 
 
Retinoic acid receptor beta
Name:Retinoic acid receptor beta
Type:PROTEIN
Mol. Mass.:50498.70
Organism:Homo sapiens (Human)
Description:ChEMBL_1458015
Residue:455
BDBM50066907
NameBDBM50066907
Synonyms:4-[(E)-2-(3,3-Dimethyl-2,3-dihydro-benzo[b]thiophen-5-yl)-propenyl]-benzoic acid | CHEMBL118754
TypeSmall organic molecule
Emp. Form.C20H20O2S
Mol. Mass.324.437
SMILESC\C(=C/c1ccc(cc1)C(O)=O)c1ccc2SCC(C)(C)c2c1