Reaction Details
TargetL-lactate dehydrogenase B chain
LigandBDBM50066976
Substrate/Competitorn/a
Meas. Tech.ChEMBL_96433 (CHEMBL706380)
Ki 500±n/a nM
Citation Deck, LMRoyer, REChamblee, BBHernandez, VMMalone, RRTorres, JEHunsaker, LAPiper, RCMakler, MTVander Jagt, DL Selective inhibitors of human lactate dehydrogenases and lactate dehydrogenase from the malarial parasite Plasmodium falciparum. J Med Chem41:3879-87 (1998) 
 
L-lactate dehydrogenase B chain
Name:L-lactate dehydrogenase B chain
Type:Oxidoreductase; homotetramer
Mol. Mass.:36635.55
Organism:Homo sapiens (Human)
Description:n/a
Residue:334
BDBM50066976
NameBDBM50066976
Synonyms:7-Benzyl-2,3-dihydroxy-4,6-dimethyl-naphthalene-1-carboxylic acid | CHEMBL435995
TypeSmall organic molecule
Emp. Form.C20H18O4
Mol. Mass.322.3545
SMILESCc1cc2c(C)c(O)c(O)c(C(O)=O)c2cc1Cc1ccccc1