Reaction Details
TargetL-lactate dehydrogenase B chain
LigandBDBM50066978
Substrate/Competitorn/a
Meas. Tech.ChEMBL_96433 (CHEMBL706380)
Ki 34000±n/a nM
Citation Deck, LMRoyer, REChamblee, BBHernandez, VMMalone, RRTorres, JEHunsaker, LAPiper, RCMakler, MTVander Jagt, DL Selective inhibitors of human lactate dehydrogenases and lactate dehydrogenase from the malarial parasite Plasmodium falciparum. J Med Chem41:3879-87 (1998) 
 
L-lactate dehydrogenase B chain
Name:L-lactate dehydrogenase B chain
Type:Oxidoreductase; homotetramer
Mol. Mass.:36635.55
Organism:Homo sapiens (Human)
Description:n/a
Residue:334
BDBM50066978
NameBDBM50066978
Synonyms:2,3-Dihydroxy-4,6-dimethyl-naphthalene-1-carboxylic acid | CHEMBL127645
TypeSmall organic molecule
Emp. Form.C13H12O4
Mol. Mass.232.232
SMILESCc1ccc2c(C(O)=O)c(O)c(O)c(C)c2c1