Reaction Details
TargetL-lactate dehydrogenase B chain
LigandBDBM50066979
Substrate/Competitorn/a
Meas. Tech.ChEMBL_96433 (CHEMBL706380)
Ki 100±n/a nM
Citation Deck, LMRoyer, REChamblee, BBHernandez, VMMalone, RRTorres, JEHunsaker, LAPiper, RCMakler, MTVander Jagt, DL Selective inhibitors of human lactate dehydrogenases and lactate dehydrogenase from the malarial parasite Plasmodium falciparum. J Med Chem41:3879-87 (1998) 
 
L-lactate dehydrogenase B chain
Name:L-lactate dehydrogenase B chain
Type:Oxidoreductase; homotetramer
Mol. Mass.:36635.55
Organism:Homo sapiens (Human)
Description:n/a
Residue:334
BDBM50066979
NameBDBM50066979
Synonyms:2,3-Dihydroxy-6,7-dimethyl-4-propyl-naphthalene-1-carboxylic acid | CHEMBL338325
TypeSmall organic molecule
Emp. Form.C16H18O4
Mol. Mass.274.3117
SMILESCCCc1c(O)c(O)c(C(O)=O)c2cc(C)c(C)cc12