Reaction Details
TargetAdenosine receptor A3
LigandBDBM50067081
Substrate/Competitorn/a
Meas. Tech.ChEMBL_31997 (CHEMBL646594)
Ki 7.9±n/a nM
Citation van Muijlwijk-Koezen, JETimmerman, HLink, Rvan der Goot, HIJzerman, AP A novel class of adenosine A3 receptor ligands. 1. 3-(2-Pyridinyl)isoquinoline derivatives. J Med Chem41:3987-93 (1998) 
 
Adenosine receptor A3
Name:Adenosine receptor A3
Type:G Protein-Coupled Receptor (GPCR)
Mol. Mass.:36197.32
Organism:Homo sapiens (Human)
Description:P0DMS8
Residue:318
BDBM50067081
NameBDBM50067081
Synonyms:9-Fluoro-2-furan-2-yl-5,6-dihydro-[1,2,4]triazolo[1,5-c]quinazolin-5-ylamine CGS-15943 | CHEMBL70605
TypeSmall organic molecule
Emp. Form.C13H8FN5O
Mol. Mass.269.2339
SMILESNc1nc2ccc(F)cc2c2nc(nn12)-c1ccco1