Reaction Details
TargetHistamine H3 receptor
LigandBDBM50067472
Substrate/Competitorn/a
Meas. Tech.ChEMBL_86901 (CHEMBL698411)
Ki 2.3±n/a nM
Citation Krause, MLigneau, XStark, HGarbarg, MSchwartz, JCSchunack, W 4-Alkynylphenyl imidazolylpropyl ethers as selective histamine H3-receptor antagonists with high oral central nervous system activity. J Med Chem41:4171-6 (1998) 
 
Histamine H3 receptor
Name:Histamine H3 receptor
Type:G Protein-Coupled Receptor (GPCR)
Mol. Mass.:48607.98
Organism:Rattus norvegicus (rat)
Description:n/a
Residue:445
BDBM50067472
NameBDBM50067472
Synonyms:4-[3-(4-Ethynyl-phenoxy)-propyl]-1H-imidazole CHEMBL309600
TypeSmall organic molecule
Emp. Form.C14H14N2O
Mol. Mass.226.2738
SMILESC#Cc1ccc(OCCCc2cnc[nH]2)cc1