Reaction Details
TargetTyrosine-protein kinase JAK2
LigandBDBM50335202
Substrate/Competitorn/a
Meas. Tech.ChEMBL_1848930 (CHEMBL4349471)
IC50 3.9±n/a nM
Citation Miao, QMa, KChen, DWu, XJiang, S Targeting tropomyosin receptor kinase for cancer therapy. Eur J Med Chem175:129-148 (2019) 
 
Tyrosine-protein kinase JAK2
Name:Tyrosine-protein kinase JAK2
Type:Protein
Mol. Mass.:130684.68
Organism:Homo sapiens (Human)
Description:O60674
Residue:1132
BDBM50335202
NameBDBM50335202
Synonyms:5-Chloro-N2-[(1S)-1-(5-fluoropyrimidin-2-yl)ethyl]-N4-(5-methoxy-1H-pyrazol-3-yl)pyrimidine-2,4-diamine | CHEMBL1650723
TypeSmall organic molecule
Emp. Form.C14H14ClFN8O
Mol. Mass.364.765
SMILESCOc1cc(Nc2nc(N[C@@H](C)c3ncc(F)cn3)ncc2Cl)[nH]n1