Reaction Details
TargetDual specificity protein kinase TTK
LigandBDBM241235
Substrate/Competitorn/a
Meas. Tech.ChEMBL_1848998 (CHEMBL4349539)
IC50 20±n/a nM
Citation Wang, SZhang, MLiang, DSun, WZhang, CJiang, MLiu, JLi, JLi, CYang, XZhou, X Molecular design and anticancer activities of small-molecule monopolar spindle 1 inhibitors: A Medicinal chemistry perspective. Eur J Med Chem175:247-268 (2019) 
 
Dual specificity protein kinase TTK
Name:Dual specificity protein kinase TTK
Type:Protein
Mol. Mass.:97086.79
Organism:Homo sapiens (Human)
Description:P33981
Residue:857
BDBM241235
NameBDBM241235
Synonyms:US10479788, Example 77 US9409907, 77
TypeSmall organic molecule
Emp. Form.C24H29N7O
Mol. Mass.431.5334
SMILESCOc1cc(ccc1Nc1ncc2ccnc(N[C@@H](C)C(C)(C)C)c2n1)-c1cnn(C)c1