Reaction Details
TargetVitamin K-dependent protein C
LigandBDBM50067522
Substrate/Competitorn/a
Meas. Tech.ChEMBL_27848 (CHEMBL642273)
Ki 43000±n/a nM
Citation Gabriel, BStubbs, MTBergner, AHauptmann, JBode, WStürzebecher, JMoroder, L Design of benzamidine-type inhibitors of factor Xa. J Med Chem41:4240-50 (1998) 
 
Vitamin K-dependent protein C
Name:Vitamin K-dependent protein C
Type:Enzyme
Mol. Mass.:52067.73
Organism:Homo sapiens (Human)
Description:n/a
Residue:461
BDBM50067522
NameBDBM50067522
Synonyms:2-[2-(4-Carbamimidoyl-benzenesulfonylamino)-acetylamino]-3-(4-carbamimidoyl-phenyl)-propionic acid ethyl ester | CHEMBL135815
TypeSmall organic molecule
Emp. Form.C21H26N6O5S
Mol. Mass.474.533
SMILESCCOC(=O)C(Cc1ccc(cc1)C(N)=N)NC(=O)CNS(=O)(=O)c1ccc(cc1)C(N)=N